Target
Histamine H3 receptor
Ligand
BDBM50371306
Substrate
Meas. Tech.
ChEMBL_463175 (CHEMBL948189)
Ki
10.6±n/a nM
Citation
 Ly, KSLetavic, MAKeith, JMMiller, JMStocking, EMBarbier, AJBonaventure, PLord, BJiang, XBoggs, JDDvorak, LMiller, KLNepomuceno, DWilson, SJCarruthers, NI Synthesis and biological activity of piperazine and diazepane amides that are histamine H3 antagonists and serotonin reuptake inhibitors. Bioorg Med Chem Lett 18:39-43 (2008)  
Target
Name:
Histamine H3 receptor
Synonyms:
G-protein coupled receptor 97 HH3R HRH3 Histamine H3 receptor (H3) Histamine receptor (H3 and H4)
Type:
G Protein-Coupled Receptor (GPCR)
Mol. Mass.:
48691.47
Organism:
Homo sapiens (Human)
Description:
Binding assays were using CHO cells stably expressing hH3R receptors.
Residue:
445
  
Inhibitor
Name:
BDBM50371306
Synonyms:
CHEMBL257917 | JNJ-28583867
Type:
Small organic molecule
Emp. Form.:
C24H32N2O2S
Mol. Mass.:
412.588
SMILES:
CSc1ccc(cc1)[C@@H]1CN(C)Cc2cc(OCCCN3CCOCC3)ccc12
: