Target
72 kDa type IV collagenase
Ligand
BDBM50371353
Substrate
Meas. Tech.
ChEMBL_463236 (CHEMBL930625)
Ki
>3333±n/a nM
Citation
 Ott, GRAsakawa, NLu, ZLiu, RQCovington, MBVaddi, KQian, MNewton, RCChrist, DDTraskos, JMDecicco, CPDuan, JJ Alpha,beta-cyclic-beta-benzamido hydroxamic acids: novel templates for the design, synthesis, and evaluation of selective inhibitors of TNF-alpha converting enzyme (TACE). Bioorg Med Chem Lett 18:694-9 (2008)  
Target
Name:
72 kDa type IV collagenase
Synonyms:
72 kDa gelatinase CLG4A Gelatinase A (MMP-2) MMP2_HUMAN Matrix metalloproteinase-2 (MMP 2) Matrix metalloproteinases 2 (MMP-2) | TBE-1
Type:
Enzyme
Mol. Mass.:
73870.36
Organism:
Homo sapiens (Human)
Description:
P08253
Residue:
660
  
Inhibitor
Name:
BDBM50371353
Synonyms:
CHEMBL272341
Type:
Small organic molecule
Emp. Form.:
C24H23N3O5
Mol. Mass.:
433.4565
SMILES:
Cc1cc(COc2ccc(cc2)C(=O)N[C@@H]2CC(=O)C[C@@H]2C(=O)NO)c2ccccc2n1
: