Target
Lysophosphatidic acid receptor 3
Ligand
BDBM50373826
Substrate
Meas. Tech.
ChEMBL_468545 (CHEMBL931968)
IC50
>50000±n/a nM
Citation
 Beck, HPKohn, TRubenstein, SHedberg, CSchwandner, RHasslinger, KDai, KLi, CLiang, LWesche, HFrank, BAn, SWickramasinghe, DJaen, JMedina, JHungate, RShen, W Discovery of potent LPA2 (EDG4) antagonists as potential anticancer agents. Bioorg Med Chem Lett 18:1037-41 (2008)  
Target
Name:
Lysophosphatidic acid receptor 3
Synonyms:
EDG7 LPAR3 Lysophosphatidic acid receptor 1/3 Lysophosphatidic acid receptor Edg-7
Type:
Enzyme
Mol. Mass.:
40149.72
Organism:
Homo sapiens (Human)
Description:
Q9UBY5
Residue:
353
  
Inhibitor
Name:
BDBM50373826
Synonyms:
CHEMBL256470
Type:
Small organic molecule
Emp. Form.:
C20H23Cl2N5O2S2
Mol. Mass.:
500.465
SMILES:
C[C@@H](CN1CCN(CC1)S(=O)(=O)c1ccc(Cl)c(Cl)c1)Nc1ncnc2c(C)csc12
: