Target
Procathepsin L
Ligand
BDBM50374365
Substrate
Meas. Tech.
ChEMBL_469265 (CHEMBL949947)
Ki
1000±n/a nM
Citation
 Maryanoff, BECostanzo, MJ Inhibitors of proteases and amide hydrolases that employ an alpha-ketoheterocycle as a key enabling functionality. Bioorg Med Chem 16:1562-95 (2008)  
Target
Name:
Procathepsin L
Synonyms:
CATL1_HUMAN CTSL CTSL1 Cathepsin L Cathepsin L1 heavy chain MEP cathepsin L preproprotein
Type:
Enzyme
Mol. Mass.:
37557.19
Organism:
Homo sapiens (Human)
Description:
Purchased from Calbiochem (San Diego, CA).
Residue:
333
  
Inhibitor
Name:
BDBM50374365
Synonyms:
CHEMBL209215
Type:
Small organic molecule
Emp. Form.:
C26H27F3N4O6
Mol. Mass.:
548.511
SMILES:
CCC[C@H](NC(=O)C1(CCCCC1)NC(=O)c1ccc(OC(F)(F)F)cc1)C(=O)c1nnc(o1)-c1ccco1
: