Target
Fatty-acid amide hydrolase 1 [30-579]
Ligand
BDBM50204510
Substrate
Meas. Tech.
ChEMBL_469283 (CHEMBL949127)
Ki
0.8±n/a nM
Citation
 Maryanoff, BECostanzo, MJ Inhibitors of proteases and amide hydrolases that employ an alpha-ketoheterocycle as a key enabling functionality. Bioorg Med Chem 16:1562-95 (2008)  
Target
Name:
Fatty-acid amide hydrolase 1 [30-579]
Synonyms:
Anandamide amidohydrolase 1 Faah Fatty Acid Amide Hydrolase Fatty-acid amide hydrolase (FAAH) Fatty-acid amide hydrolase 1 (FAAH) Oleamide hydrolase 1
Type:
Single-pass membrane protein; homodimer
Mol. Mass.:
60474.00
Organism:
Rattus norvegicus (rat)
Description:
P97612 (aa 30-579)
Residue:
550
  
Inhibitor
Name:
BDBM50204510
Synonyms:
1-(5-(4-methoxypyridin-2-yl)oxazol-2-yl)-7-phenylheptan-1-one | CHEMBL220629
Type:
Small organic molecule
Emp. Form.:
C22H24N2O3
Mol. Mass.:
364.4376
SMILES:
COc1ccnc(c1)-c1cnc(o1)C(=O)CCCCCCc1ccccc1
: