Target
Alpha-1A adrenergic receptor
Ligand
BDBM50377400
Substrate
Meas. Tech.
ChEMBL_479649 (CHEMBL921450)
EC50
426±n/a nM
Citation
 Whitlock, GAConlon, KMcMurray, GRoberts, LRStobie, AThurlow, RJ Novel 2-imidazoles as potent and selective alpha1A adrenoceptor partial agonists. Bioorg Med Chem Lett 18:2930-4 (2008)  
Target
Name:
Alpha-1A adrenergic receptor
Synonyms:
ADA1A_HUMAN ADRA1C Alpha 1A-adrenoceptor Alpha adrenergic receptor 1a Alpha-adrenergic receptor 1c adrenergic Alpha1 | adrenergic Alpha1C
Type:
Cell-surface receptors
Mol. Mass.:
51511.67
Organism:
Homo sapiens (Human)
Description:
P35348
Residue:
466
  
Inhibitor
Name:
BDBM50377400
Synonyms:
CHEMBL260116
Type:
Small organic molecule
Emp. Form.:
C15H13N3S
Mol. Mass.:
267.349
SMILES:
C1Cc2c(cccc2-c2nccs2)C1c1ncc[nH]1
: