Target
Alpha-1D adrenergic receptor
Ligand
BDBM50377395
Substrate
Meas. Tech.
ChEMBL_479653 (CHEMBL922401)
EC50
>10000±n/a nM
Citation
 Whitlock, GAConlon, KMcMurray, GRoberts, LRStobie, AThurlow, RJ Novel 2-imidazoles as potent and selective alpha1A adrenoceptor partial agonists. Bioorg Med Chem Lett 18:2930-4 (2008)  
Target
Name:
Alpha-1D adrenergic receptor
Synonyms:
ADA1D_HUMAN ADRA1D Adrenergic receptor alpha Alpha 1D-adrenoreceptor Alpha-1D adrenoceptor adrenergic Alpha1D
Type:
Enzyme Catalytic Domain
Mol. Mass.:
60485.82
Organism:
Homo sapiens (Human)
Description:
adrenergic Alpha1D ADRA1D HUMAN::P25100
Residue:
572
  
Inhibitor
Name:
BDBM50377395
Synonyms:
CHEMBL257800
Type:
Small organic molecule
Emp. Form.:
C13H15N3O2S
Mol. Mass.:
277.342
SMILES:
CS(=O)(=O)Nc1cccc2C(CCc12)c1ncc[nH]1
: