Target
Xanthine dehydrogenase/oxidase
Ligand
BDBM50250465
Substrate
Meas. Tech.
ChEMBL_547369 (CHEMBL1023248)
IC50
>100000±n/a nM
Citation
 Cos, PYing, LCalomme, MHu, JPCimanga, KVan Poel, BPieters, LVlietinck, AJVanden Berghe, D Structure-activity relationship and classification of flavonoids as inhibitors of xanthine oxidase and superoxide scavengers. J Nat Prod 61:71-6 (1998)  
Target
Name:
Xanthine dehydrogenase/oxidase
Synonyms:
XD XDHA XO Xanthine dehydrogenase/oxidase | Xanthine oxidase
Type:
Enzyme
Mol. Mass.:
146441.21
Organism:
Homo sapiens (Human)
Description:
P47989
Residue:
1333
  
Inhibitor
Name:
BDBM50250465
Synonyms:
6-glucosyl-8-xylosylapigenin | CHEMBL504233
Type:
Small organic molecule
Emp. Form.:
C26H28O17
Mol. Mass.:
612.4903
SMILES:
OC[C@H]1OC(Oc2c(O)c(OC3OC[C@@H](O)[C@H](O)[C@H]3O)c3oc(c(O)c(=O)c3c2O)-c2ccc(O)cc2)[C@H](O)[C@@H](O)[C@@H]1O
: