Target
Xanthine dehydrogenase/oxidase
Ligand
BDBM50240614
Substrate
Meas. Tech.
ChEMBL_547369 (CHEMBL1023248)
IC50
7700±n/a nM
Citation
 Cos, PYing, LCalomme, MHu, JPCimanga, KVan Poel, BPieters, LVlietinck, AJVanden Berghe, D Structure-activity relationship and classification of flavonoids as inhibitors of xanthine oxidase and superoxide scavengers. J Nat Prod 61:71-6 (1998)  
Target
Name:
Xanthine dehydrogenase/oxidase
Synonyms:
XD XDHA XO Xanthine dehydrogenase/oxidase | Xanthine oxidase
Type:
Enzyme
Mol. Mass.:
146441.21
Organism:
Homo sapiens (Human)
Description:
P47989
Residue:
1333
  
Inhibitor
Name:
BDBM50240614
Synonyms:
3,5-Dihydroxy-2-(3-hydroxy-4-methoxy-phenyl)-7-methoxy-chromen-4-one CHEMBL75589 OMBUINE | quercetin-7,4'-dimethyl ether
Type:
Small organic molecule
Emp. Form.:
C17H14O7
Mol. Mass.:
330.2889
SMILES:
COc1cc(O)c2c(c1)oc(-c1ccc(OC)c(O)c1)c(O)c2=O
: