Target
Xanthine dehydrogenase/oxidase
Ligand
BDBM50209218
Substrate
Meas. Tech.
ChEMBL_547369 (CHEMBL1023248)
IC50
>100000±n/a nM
Citation
 Cos, PYing, LCalomme, MHu, JPCimanga, KVan Poel, BPieters, LVlietinck, AJVanden Berghe, D Structure-activity relationship and classification of flavonoids as inhibitors of xanthine oxidase and superoxide scavengers. J Nat Prod 61:71-6 (1998)  
Target
Name:
Xanthine dehydrogenase/oxidase
Synonyms:
XD XDHA XO Xanthine dehydrogenase/oxidase | Xanthine oxidase
Type:
Enzyme
Mol. Mass.:
146441.21
Organism:
Homo sapiens (Human)
Description:
P47989
Residue:
1333
  
Inhibitor
Name:
BDBM50209218
Synonyms:
4',5,6,7,8-pentamethoxyflavone 5,6,7,8-tetramethoxy-2-(4-methoxyphenyl)-4H-chromen-4-one Tangeretin
Type:
Small organic molecule
Emp. Form.:
C20H20O7
Mol. Mass.:
372.3686
SMILES:
COc1ccc(cc1)-c1cc(=O)c2c(OC)c(OC)c(OC)c(OC)c2o1
: