Target
Melanocortin receptor 3
Ligand
BDBM50121268
Substrate
Meas. Tech.
ChEMBL_523577 (CHEMBL997227)
EC50
<0.1±n/a nM
Comments
Zero 20220115
Citation
 Qu, HCai, MMayorov, AVGrieco, PZingsheim, MTrivedi, DHruby, VJ Substitution of arginine with proline and proline derivatives in melanocyte-stimulating hormones leads to selectivity for human melanocortin 4 receptor. J Med Chem 52:3627-35 (2009)  
Target
Name:
Melanocortin receptor 3
Synonyms:
MC3-R MC3R_HUMAN Melanocortin receptor (M3 and M4)
Type:
Enzyme
Mol. Mass.:
36044.86
Organism:
Homo sapiens (Human)
Description:
P41968
Residue:
323
  
Inhibitor
Name:
BDBM50121268
Synonyms:
21-(2-Acetylamino-hexanoylamino)-7-[3-(diaminomethaniminium)-propyl]-10-(1H-indol-3-ylmethyl)-4-naphthalen-2-ylmethyl-2,5,8,11,19,22-hexaoxo-3,6,9,12,18,23-hexaaza-tricyclo[21.7.0.0*24,29*]triaconta-24(29),25,27 CID44366078 | SHU-9119
Type:
Small organic molecule
Emp. Form.:
C54H71N15O9
Mol. Mass.:
1074.2366
SMILES:
CCCC[C@@H](NC(C)=O)C(=O)N[C@@H]1CC(=O)NCCCC[C@H](NC(=O)[C@H](Cc2c[nH]c3ccccc23)NC(=O)[C@H](CCCNC(N)=N)NC(=O)[C@@H](Cc2ccc3ccccc3c2)NC(=O)[C@H](Cc2c[nH]cn2)NC1=O)C(N)=O
: