Target
Melanocortin receptor 5
Ligand
BDBM50268803
Substrate
Meas. Tech.
ChEMBL_523579 (CHEMBL997229)
EC50
<0.1±n/a nM
Comments
Zero 20220115
Citation
 Qu, HCai, MMayorov, AVGrieco, PZingsheim, MTrivedi, DHruby, VJ Substitution of arginine with proline and proline derivatives in melanocyte-stimulating hormones leads to selectivity for human melanocortin 4 receptor. J Med Chem 52:3627-35 (2009)  
Target
Name:
Melanocortin receptor 5
Synonyms:
MC-2 MC5R Melanocortin MC5 Melanocortin receptor 5 | Melanocortin receptor 5 (MC5R)
Type:
Enzyme
Mol. Mass.:
36612.92
Organism:
Homo sapiens (Human)
Description:
P33032
Residue:
325
  
Inhibitor
Name:
BDBM50268803
Synonyms:
Ac-Tyr-Val-Nle-Gly-His-DPhe-cis-Xaa-Trp-Asp-Arg-Phe-Gly-NH2 | CHEMBL525399
Type:
Small organic molecule
Emp. Form.:
C77H102N22O16
Mol. Mass.:
1591.7716
SMILES:
CCCC[C@H](NC(=O)[C@@H](NC(=O)[C@H](Cc1ccc(O)cc1)NC(C)=O)C(C)C)C(=O)NCC(=O)N[C@@H](Cc1cnc[nH]1)C(=O)N[C@H](Cc1ccccc1)C(=O)N1C[C@H](C[C@H]1C(=O)N[C@@H](Cc1c[nH]c2ccccc12)C(=O)N[C@@H](CC(O)=O)C(=O)N[C@@H](CCCN=C(N)N)C(=O)N[C@@H](Cc1ccccc1)C(=O)NCC(N)=O)N=C(N)N
: