Target
Prostaglandin G/H synthase 1
Ligand
BDBM50110927
Substrate
Meas. Tech.
ChEMBL_638977 (CHEMBL1168960)
IC50
>10000±n/a nM
Citation
 Bridoux, AMillet, RPommery, JPommery, NHenichart, JP Synthesis and biological activity of N-aroyl-tetrahydro-gamma-carbolines. Bioorg Med Chem 18:3910-24 (2010)  
Target
Name:
Prostaglandin G/H synthase 1
Synonyms:
COX-1 Cyclooxygenase Cyclooxygenase-1 (COX-1) PTGS1 | Prostaglandin G/H synthase (cyclooxygenase)
Type:
Enzyme
Mol. Mass.:
68692.62
Organism:
Homo sapiens (Human)
Description:
P23219
Residue:
599
  
Inhibitor
Name:
BDBM50110927
Synonyms:
1-(4-Chloro-benzyl)-5-methanesulfonyl-1H-indole-2-carboxylic acid methyl ester methyl 1-(4-chlorobenzyl)-5-(methylsulfonyl)-1H-indole-2-carboxylate
Type:
Small organic molecule
Emp. Form.:
C18H16ClNO4S
Mol. Mass.:
377.842
SMILES:
COC(=O)c1cc2cc(ccc2n1Cc1ccc(Cl)cc1)S(C)(=O)=O
: