Target
Sigma non-opioid intracellular receptor 1
Ligand
BDBM50322255
Substrate
Meas. Tech.
ChEMBL_642593 (CHEMBL1176482)
Ki
12.1±n/a nM
Citation
 Vangveravong, STaylor, MXu, JCui, JCalvin, WBabic, SLuedtke, RRMach, RH Synthesis and characterization of selective dopamine D2 receptor antagonists. 2. Azaindole, benzofuran, and benzothiophene analogs of L-741,626. Bioorg Med Chem 18:5291-300 (2010)  
Target
Name:
Sigma non-opioid intracellular receptor 1
Synonyms:
OPRS1 SIGMAR1 Sigma non-opioid intracellular receptor 1 Sigma1-receptor Sterol isomerase-like protein
Type:
Protein
Mol. Mass.:
25307.17
Organism:
Cavia porcellus (Guinea pig)
Description:
Q60492
Residue:
223
  
Inhibitor
Name:
BDBM50322255
Synonyms:
1-((1H-indol-3-yl)methyl)-4-(4-bromophenyl)piperidin-4-ol | CHEMBL1170683
Type:
Small organic molecule
Emp. Form.:
C20H21BrN2O
Mol. Mass.:
385.298
SMILES:
OC1(CCN(Cc2c[nH]c3ccccc23)CC1)c1ccc(Br)cc1
: