Target
Sigma non-opioid intracellular receptor 1
Ligand
BDBM50322240
Substrate
Meas. Tech.
ChEMBL_642593 (CHEMBL1176482)
Ki
0.59±n/a nM
Citation
 Vangveravong, STaylor, MXu, JCui, JCalvin, WBabic, SLuedtke, RRMach, RH Synthesis and characterization of selective dopamine D2 receptor antagonists. 2. Azaindole, benzofuran, and benzothiophene analogs of L-741,626. Bioorg Med Chem 18:5291-300 (2010)  
Target
Name:
Sigma non-opioid intracellular receptor 1
Synonyms:
OPRS1 SIGMAR1 Sigma non-opioid intracellular receptor 1 Sigma1-receptor Sterol isomerase-like protein
Type:
Protein
Mol. Mass.:
25307.17
Organism:
Cavia porcellus (Guinea pig)
Description:
Q60492
Residue:
223
  
Inhibitor
Name:
BDBM50322240
Synonyms:
1-(Benzofuran-3-ylmethyl)-4-(4-bromophenyl)piperidin-4-ol oxalate | CHEMBL1172213
Type:
Small organic molecule
Emp. Form.:
C20H20BrNO2
Mol. Mass.:
386.282
SMILES:
OC1(CCN(Cc2coc3ccccc23)CC1)c1ccc(Br)cc1
: