Target
Beta-secretase 1
Ligand
BDBM50322887
Substrate
Meas. Tech.
ChEMBL_644686 (CHEMBL1211665)
IC50
190±n/a nM
Citation
 Clarke, BCutler, LDemont, EDingwall, CDunsdon, RHawkins, JHowes, CHussain, IMaile, GMatico, RMosley, JNaylor, AO'Brien, ARedshaw, SRowland, PSoleil, VSmith, KJSweitzer, STheobald, PVesey, DWalter, DSWayne, G BACE-1 hydroxyethylamine inhibitors using novel edge-to-face interaction with Arg-296. Bioorg Med Chem Lett 20:4639-44 (2010)  
Target
Name:
Beta-secretase 1
Synonyms:
ASP2 Aspartyl protease 2 BACE1 Beta-secretase (BACE) Beta-secretase 1 (BACE 1) Beta-secretase 1 (BACE1) Beta-site amyloid precursor protein cleaving enzyme 1 Memapsin-2 beta-Secretase (BACE-1) | beta-Secretase (BACE1)
Type:
Protein
Mol. Mass.:
55755.10
Organism:
Homo sapiens (Human)
Description:
P56817
Residue:
501
  
Inhibitor
Name:
BDBM50322887
Synonyms:
3-(N-(4-cyanophenyl)methylsulfonamido)-N-((2S,3R)-4-((S)-1-(cyclohexylamino)-1-oxopropan-2-ylamino)-3-hydroxy-1-phenylbutan-2-yl)benzamide | CHEMBL1210348
Type:
Small organic molecule
Emp. Form.:
C34H41N5O5S
Mol. Mass.:
631.785
SMILES:
C[C@H](NC[C@@H](O)[C@H](Cc1ccccc1)NC(=O)c1cccc(c1)N(c1ccc(cc1)C#N)S(C)(=O)=O)C(=O)NC1CCCCC1
: