Target
Cathepsin D
Ligand
BDBM50322880
Substrate
Meas. Tech.
ChEMBL_644688 (CHEMBL1211667)
IC50
193±n/a nM
Citation
 Clarke, BCutler, LDemont, EDingwall, CDunsdon, RHawkins, JHowes, CHussain, IMaile, GMatico, RMosley, JNaylor, AO'Brien, ARedshaw, SRowland, PSoleil, VSmith, KJSweitzer, STheobald, PVesey, DWalter, DSWayne, G BACE-1 hydroxyethylamine inhibitors using novel edge-to-face interaction with Arg-296. Bioorg Med Chem Lett 20:4639-44 (2010)  
Target
Name:
Cathepsin D
Synonyms:
CATD_HUMAN CTSD Cathepsin D heavy chain Cathepsin D precursor
Type:
Enzyme
Mol. Mass.:
44551.72
Organism:
Homo sapiens (Human)
Description:
Human proCathepsin D (SwissProt accession number P07339) was expressed in Sf9 cells, purified, and autoactivated.
Residue:
412
  
Inhibitor
Name:
BDBM50322880
Synonyms:
CHEMBL1210432 | N-((2S,3R)-4-(cyclohexylamino)-3-hydroxy-1-phenylbutan-2-yl)-3-(N-phenylmethylsulfonamido)benzamide
Type:
Small organic molecule
Emp. Form.:
C30H37N3O4S
Mol. Mass.:
535.697
SMILES:
CS(=O)(=O)N(c1ccccc1)c1cccc(c1)C(=O)N[C@@H](Cc1ccccc1)[C@H](O)CNC1CCCCC1
: