Target
Cyclin-dependent kinase 1
Ligand
BDBM5655
Substrate
Meas. Tech.
ChEMBL_653792 (CHEMBL1226914)
IC50
30±n/a nM
Citation
 Montagnoli, AValsasina, BCroci, VMenichincheri, MRainoldi, SMarchesi, VTibolla, MTenca, PBrotherton, DAlbanese, CPatton, VAlzani, RCiavolella, ASola, FMolinari, AVolpi, DAvanzi, NFiorentini, FCattoni, MHealy, SBallinari, DPesenti, EIsacchi, AMoll, JBensimon, AVanotti, ESantocanale, C A Cdc7 kinase inhibitor restricts initiation of DNA replication and has antitumor activity. Nat Chem Biol 4:357-65 (2008)  
Target
Name:
Cyclin-dependent kinase 1
Synonyms:
CDC2 CDK1 CDKN1 Cell division protein kinase 1 P34CDC2 | p34 protein kinase
Type:
Enzyme Subunit
Mol. Mass.:
34101.08
Organism:
Homo sapiens (Human)
Description:
P06493
Residue:
297
  
Inhibitor
Name:
BDBM5655
Synonyms:
2-(2-chlorophenyl)-5,7-dihydroxy-8-[(3S,4R)-3-hydroxy-1-methylpiperidin-4-yl]-4H-chromen-4-one Flavopiridol US9617225, Flavopiridol
Type:
Small organic molecule
Emp. Form.:
C21H20ClNO5
Mol. Mass.:
401.84
SMILES:
CN1CC[C@@H]([C@H](O)C1)c1c(O)cc(O)c2c1oc(cc2=O)-c1ccccc1Cl
: