Target
Tyrosine-protein kinase JAK1
Ligand
BDBM50332298
Substrate
Meas. Tech.
ChEMBL_686109 (CHEMBL1292865)
IC50
610±n/a nM
Citation
 Malerich, JPLam, JSHart, BFine, RMKlebansky, BTanga, MJD'Andrea, A Diamino-1,2,4-triazole derivatives are selective inhibitors of TYK2 and JAK1 over JAK2 and JAK3. Bioorg Med Chem Lett 20:7454-7 (2010)  
Target
Name:
Tyrosine-protein kinase JAK1
Synonyms:
JAK-1 JAK1A JAK1_HUMAN Janus kinase 1 (JAK1) | Janus kinase 1 JAK1
Type:
Protein
Mol. Mass.:
133293.73
Organism:
Homo sapiens (Human)
Description:
P23458
Residue:
1154
  
Inhibitor
Name:
BDBM50332298
Synonyms:
3-(5-amino-1-(2,6-difluorobenzoyl)-1H-1,2,4-triazol-3-ylamino)benzoic acid | CHEMBL1287910
Type:
Small organic molecule
Emp. Form.:
C16H11F2N5O3
Mol. Mass.:
359.287
SMILES:
Nc1nc(Nc2cccc(c2)C(O)=O)nn1C(=O)c1c(F)cccc1F
: