Target
Tyrosine-protein kinase JAK1
Ligand
BDBM50332299
Substrate
Meas. Tech.
ChEMBL_686109 (CHEMBL1292865)
IC50
500±n/a nM
Citation
 Malerich, JPLam, JSHart, BFine, RMKlebansky, BTanga, MJD'Andrea, A Diamino-1,2,4-triazole derivatives are selective inhibitors of TYK2 and JAK1 over JAK2 and JAK3. Bioorg Med Chem Lett 20:7454-7 (2010)  
Target
Name:
Tyrosine-protein kinase JAK1
Synonyms:
JAK-1 JAK1A JAK1_HUMAN Janus kinase 1 (JAK1) | Janus kinase 1 JAK1
Type:
Protein
Mol. Mass.:
133293.73
Organism:
Homo sapiens (Human)
Description:
P23458
Residue:
1154
  
Inhibitor
Name:
BDBM50332299
Synonyms:
CHEMBL1287940 | methyl 4-(5-amino-1-(2,6-difluorobenzoyl)-1H-1,2,4-triazol-3-ylamino)benzoate
Type:
Small organic molecule
Emp. Form.:
C17H13F2N5O3
Mol. Mass.:
373.3136
SMILES:
COC(=O)c1ccc(Nc2nc(N)n(n2)C(=O)c2c(F)cccc2F)cc1
: