Target
Tyrosine-protein kinase JAK3
Ligand
BDBM50332301
Substrate
Meas. Tech.
ChEMBL_686111 (CHEMBL1292867)
IC50
3250±n/a nM
Citation
 Malerich, JPLam, JSHart, BFine, RMKlebansky, BTanga, MJD'Andrea, A Diamino-1,2,4-triazole derivatives are selective inhibitors of TYK2 and JAK1 over JAK2 and JAK3. Bioorg Med Chem Lett 20:7454-7 (2010)  
Target
Name:
Tyrosine-protein kinase JAK3
Synonyms:
JAK-3 JAK3_HUMAN Janus kinase 3 (JAK3) L-JAK | Leukocyte janus kinase
Type:
Protein
Mol. Mass.:
125111.08
Organism:
Homo sapiens (Human)
Description:
P52333
Residue:
1124
  
Inhibitor
Name:
BDBM50332301
Synonyms:
(5-amino-3-(phenylamino)-1H-1,2,4-triazol-1-yl)(2,6-difluorophenyl)methanone | CHEMBL1287971
Type:
Small organic molecule
Emp. Form.:
C15H11F2N5O
Mol. Mass.:
315.2775
SMILES:
Nc1nc(Nc2ccccc2)nn1C(=O)c1c(F)cccc1F
: