Target
Tyrosine-protein kinase JAK3
Ligand
BDBM50332303
Substrate
Meas. Tech.
ChEMBL_686111 (CHEMBL1292867)
IC50
850±n/a nM
Citation
 Malerich, JPLam, JSHart, BFine, RMKlebansky, BTanga, MJD'Andrea, A Diamino-1,2,4-triazole derivatives are selective inhibitors of TYK2 and JAK1 over JAK2 and JAK3. Bioorg Med Chem Lett 20:7454-7 (2010)  
Target
Name:
Tyrosine-protein kinase JAK3
Synonyms:
JAK-3 JAK3_HUMAN Janus kinase 3 (JAK3) L-JAK | Leukocyte janus kinase
Type:
Protein
Mol. Mass.:
125111.08
Organism:
Homo sapiens (Human)
Description:
P52333
Residue:
1124
  
Inhibitor
Name:
BDBM50332303
Synonyms:
(5-amino-3-(4-(dimethylamino)phenylamino)-1H-1,2,4-triazol-1-yl)(2,6-difluorophenyl)methanone | CHEMBL1288002
Type:
Small organic molecule
Emp. Form.:
C17H16F2N6O
Mol. Mass.:
358.3453
SMILES:
CN(C)c1ccc(Nc2nc(N)n(n2)C(=O)c2c(F)cccc2F)cc1
: