Target
Non-receptor tyrosine-protein kinase TYK2
Ligand
BDBM50332306
Substrate
Meas. Tech.
ChEMBL_686112 (CHEMBL1292868)
IC50
>10000±n/a nM
Citation
 Malerich, JPLam, JSHart, BFine, RMKlebansky, BTanga, MJD'Andrea, A Diamino-1,2,4-triazole derivatives are selective inhibitors of TYK2 and JAK1 over JAK2 and JAK3. Bioorg Med Chem Lett 20:7454-7 (2010)  
Target
Name:
Non-receptor tyrosine-protein kinase TYK2
Synonyms:
Non-receptor tyrosine-protein kinase TYK2 (TYK2) TYK2_HUMAN | Tyrosine-protein kinase TYK2
Type:
Protein
Mol. Mass.:
133666.03
Organism:
Homo sapiens (Human)
Description:
P29597
Residue:
1187
  
Inhibitor
Name:
BDBM50332306
Synonyms:
CHEMBL1287970 | ethyl 3-(3-amino-1-(2,6-difluorobenzoyl)-1H-1,2,4-triazol-5-ylamino)benzoate
Type:
Small organic molecule
Emp. Form.:
C18H15F2N5O3
Mol. Mass.:
387.3402
SMILES:
CCOC(=O)c1cccc(Nc2nc(N)nn2C(=O)c2c(F)cccc2F)c1
: