Target
Heat shock protein HSP 90-alpha
Ligand
BDBM50343371
Substrate
Meas. Tech.
ChEMBL_746939 (CHEMBL1777305)
Ki
110±n/a nM
Citation
 Zehnder, LBennett, MMeng, JHuang, BNinkovic, SWang, FBraganza, JTatlock, JJewell, TZhou, JZBurke, BWang, JMaegley, KMehta, PPYin, MJGajiwala, KSHickey, MJYamazaki, SSmith, EKang, PSistla, ADovalsantos, EGehring, MRKania, RWythes, MKung, PP Optimization of potent, selective, and orally bioavailable pyrrolodinopyrimidine-containing inhibitors of heat shock protein 90. Identification of development candidate 2-amino-4-{4-chloro-2-[2-(4-fluoro-1H-pyrazol-1-yl)ethoxy]-6-methylphenyl}-N-(2,2-difluoropropyl)-5,7-dihydro-6H-pyrrolo[3,4-d]pyr J Med Chem 54:3368-85 (2011)  
Target
Name:
Heat shock protein HSP 90-alpha
Synonyms:
HS90A_HUMAN HSP86 HSP90AA1 HSPCA Heat shock 86 kDa Heat shock protein HSP 90-alpha (HSP90) LAP-2 Lipopolysaccharide-associated protein 2 heat shock protein 90kDa alpha (cytosolic), class A member 1 isoform 2
Type:
Molecular Chaperone
Mol. Mass.:
84623.45
Organism:
Homo sapiens (Human)
Description:
P07900
Residue:
732
  
Inhibitor
Name:
BDBM50343371
Synonyms:
2-amino-N-cyclobutyl-4-(2,4-dichloro-6-propoxyphenyl)-5H-pyrrolo[3,4-d]pyrimidine-6(7H)-carboxamide | CHEMBL1774909
Type:
Small organic molecule
Emp. Form.:
C20H23Cl2N5O2
Mol. Mass.:
436.335
SMILES:
CCCOc1cc(Cl)cc(Cl)c1-c1nc(N)nc2CN(Cc12)C(=O)NC1CCC1
: