Target
Solute carrier family 15 member 2
Ligand
BDBM42131
Substrate
Meas. Tech.
ChEMBL_762551 (CHEMBL1817008)
Ki
29000±n/a nM
Citation
 Pedretti, ADe Luca, LMarconi, CRegazzoni, LAldini, GVistoli, G Fragmental modeling of hPepT2 and analysis of its binding features by docking studies and pharmacophore mapping. Bioorg Med Chem 19:4544-51 (2011)  
Target
Name:
Solute carrier family 15 member 2
Synonyms:
Kidney H(+)/peptide cotransporter PEPT2 S15A2_HUMAN | SLC15A2
Type:
PROTEIN
Mol. Mass.:
81795.62
Organism:
Homo sapiens (Human)
Description:
ChEMBL_762551
Residue:
729
  
Inhibitor
Name:
BDBM42131
Synonyms:
CEFACLOR SMR000058250 | cid_51039
Type:
Small organic molecule
Emp. Form.:
C15H14ClN3O4S
Mol. Mass.:
367.807
SMILES:
N[C@@H](C(=O)N[C@H]1[C@H]2SCC(Cl)=C(N2C1=O)C(O)=O)c1ccccc1
: