Target
Cytochrome P450 2C9
Ligand
BDBM50380669
Substrate
Meas. Tech.
ChEMBL_813215 (CHEMBL2020947)
IC50
600±n/a nM
Citation
 Mirguet, OLamotte, YDonche, FToum, JGellibert, FBouillot, AGosmini, RNguyen, VLDelannée, DSeal, JBlandel, FBoullay, ABBoursier, EMartin, SBrusq, JMKrysa, GRiou, ATellier, RCostaz, AHuet, PDudit, YTrottet, LKirilovsky, JNicodeme, E From ApoA1 upregulation to BET family bromodomain inhibition: discovery of I-BET151. Bioorg Med Chem Lett 22:2963-7 (2012)  
Target
Name:
Cytochrome P450 2C9
Synonyms:
(R)-limonene 6-monooxygenase CP2C9_HUMAN CYP2C9 Cytochrome P450 2C9 (CYP2C9 ) P-450MP P450 PB-1 | S-mephenytoin 4-hydroxylase
Type:
Enzyme
Mol. Mass.:
55636.33
Organism:
Homo sapiens (Human)
Description:
P11712
Residue:
490
  
Inhibitor
Name:
BDBM50380669
Synonyms:
CHEMBL2017273
Type:
Small organic molecule
Emp. Form.:
C22H19FN4O3
Mol. Mass.:
406.4097
SMILES:
COc1cc2c(Nc3ccccc3F)c(cnc2cc1-c1c(C)noc1C)C(N)=O
: