Target
Sphingosine 1-phosphate receptor 3
Ligand
BDBM50384703
Substrate
Meas. Tech.
ChEMBL_820806 (CHEMBL2038511)
EC50
5600±n/a nM
Citation
 Harrington, PECroghan, MDFotsch, CFrohn, MLanman, BAPennington, LDPickrell, AJReed, ABSham, KKTasker, AArnett, HAFiorino, MLee, MRMcElvain, MMorrison, HGXu, HXu, YZhang, XWong, MCee, VJ Optimization of a Potent, Orally Active S1P1 Agonist Containing a Quinolinone Core. ACS Med Chem Lett 3:74-78 (2012)  
Target
Name:
Sphingosine 1-phosphate receptor 3
Synonyms:
C9orf108 EDG3 S1P receptor 3 S1P3 S1PR3_HUMAN Sphingosine 1-phosphate receptor 3 (S1P3) | Sphingosine 1-phosphate receptor Edg-3
Type:
G Protein-Coupled Receptor (GPCR)
Mol. Mass.:
42278.13
Organism:
Homo sapiens (Human)
Description:
Q99500
Residue:
378
  
Inhibitor
Name:
BDBM50384703
Synonyms:
CHEMBL2037122
Type:
Small organic molecule
Emp. Form.:
C25H20F3N3O2
Mol. Mass.:
451.4404
SMILES:
Cn1cc(C(=O)Nc2ccc(-c3ccccc3)c(c2)C(F)(F)F)c(=O)c2cccc(CN)c12
: