Target
Diacylglycerol O-acyltransferase 1
Ligand
BDBM50385425
Substrate
Meas. Tech.
ChEMBL_822962 (CHEMBL2038283)
IC50
13±n/a nM
Citation
 McCoull, WAddie, MSBirch, AMBirtles, SBuckett, LKButlin, RJBowker, SSBoyd, SChapman, SDavies, RDDonald, CSGreen, CPJenner, CKemmitt, PDLeach, AGMoody, GCGutierrez, PMNewcombe, NJNowak, TPacker, MJPlowright, ATRevill, JSchofield, PSheldon, CStokes, STurnbull, AVWang, SJWhalley, DPWood, JM Identification, optimisation and in vivo evaluation of oxadiazole DGAT-1 inhibitors for the treatment of obesity and diabetes. Bioorg Med Chem Lett 22:3873-8 (2012)  
Target
Name:
Diacylglycerol O-acyltransferase 1
Synonyms:
ACAT-related gene product 1 Acyl coA-diacylglycerol acyl transferase 1 (DGAT1) DGAT1 Diacylglycerol Acyltransferase (DGAT1) Diacylglycerol O-acyltransferase 1 (DGAT1) | Diglyceride acyltransferase
Type:
Protein
Mol. Mass.:
55297.82
Organism:
Homo sapiens (Human)
Description:
O75907
Residue:
488
  
Inhibitor
Name:
BDBM50385425
Synonyms:
CHEMBL2036597
Type:
Small organic molecule
Emp. Form.:
C25H24N6O4
Mol. Mass.:
472.4959
SMILES:
O=C(Nc1ccc(nc1)N1CCOCC1)c1nnc(Nc2cccc(OCc3ccccc3)c2)o1
: