Target
Biotin--protein ligase
Ligand
BDBM50388927
Substrate
Meas. Tech.
ChEMBL_831149 (CHEMBL2065962)
Ki
3850±n/a nM
Citation
 Soares da Costa, TPTieu, WYap, MYZvarec, OBell, JMTurnidge, JDWallace, JCBooker, GWWilce, MCAbell, ADPolyak, SW Biotin analogues with antibacterial activity are potent inhibitors of biotin protein ligase. ACS Med Chem Lett 3:509-514 (2012)  
Target
Name:
Biotin--protein ligase
Synonyms:
BPL1_HUMAN Biotin--[acetyl-CoA-carboxylase] ligase Biotin--[methylmalonyl-CoA-carboxytransferase] ligase HCS Holocarboxylase synthetase
Type:
PROTEIN
Mol. Mass.:
80745.43
Organism:
Homo sapiens (Human)
Description:
ChEMBL_1475435
Residue:
726
  
Inhibitor
Name:
BDBM50388927
Synonyms:
CHEMBL2063398
Type:
Small organic molecule
Emp. Form.:
C10H18N2O2S
Mol. Mass.:
230.327
SMILES:
OCCCCC[C@@H]1SC[C@@H]2NC(=O)N[C@H]12
: