Target
Biotin--protein ligase
Ligand
BDBM50388931
Substrate
Meas. Tech.
ChEMBL_831149 (CHEMBL2065962)
Ki
140±n/a nM
Citation
 Soares da Costa, TPTieu, WYap, MYZvarec, OBell, JMTurnidge, JDWallace, JCBooker, GWWilce, MCAbell, ADPolyak, SW Biotin analogues with antibacterial activity are potent inhibitors of biotin protein ligase. ACS Med Chem Lett 3:509-514 (2012)  
Target
Name:
Biotin--protein ligase
Synonyms:
BPL1_HUMAN Biotin--[acetyl-CoA-carboxylase] ligase Biotin--[methylmalonyl-CoA-carboxytransferase] ligase HCS Holocarboxylase synthetase
Type:
PROTEIN
Mol. Mass.:
80745.43
Organism:
Homo sapiens (Human)
Description:
ChEMBL_1475435
Residue:
726
  
Inhibitor
Name:
BDBM50388931
Synonyms:
CHEMBL2063402
Type:
Small organic molecule
Emp. Form.:
C10H18N2OS
Mol. Mass.:
214.328
SMILES:
CCCCC[C@@H]1SC[C@@H]2NC(=O)N[C@H]12
: