Target
Glucocorticoid receptor
Ligand
BDBM50391917
Substrate
Meas. Tech.
ChEMBL_849777 (CHEMBL2150559)
Ki
2±n/a nM
Citation
 Bungard, CJHartman, GDManikowski, JJPerkins, JJBai, CBrandish, PEEuler, DHHershey, JCSchmidt, AFang, YNorcross, RTRushmore, THThompson, CDMeissner, RS Discovery of selective glucocorticoid receptor modulator MK-5932. Bioorg Med Chem 19:7374-86 (2011)  
Target
Name:
Glucocorticoid receptor
Synonyms:
GCR_HUMAN GRL Glucocorticoid receptor (GRFP) Nuclear receptor subfamily 3 group C member 1
Type:
Enzyme
Mol. Mass.:
85656.87
Organism:
Homo sapiens (Human)
Description:
P04150
Residue:
777
  
Inhibitor
Name:
BDBM50391917
Synonyms:
CHEMBL2147557
Type:
Small organic molecule
Emp. Form.:
C29H32FN3O2
Mol. Mass.:
473.5817
SMILES:
CCCNC(=O)c1ccccc1CC[C@]1(O)CCC2=Cc3c(C[C@]12C)cnn3-c1ccc(F)cc1
: