Target
Acetylcholinesterase
Ligand
BDBM50398925
Substrate
Meas. Tech.
ChEMBL_874797 (CHEMBL2188841)
IC50
2.32±n/a nM
Citation
 Simoni, EDaniele, SBottegoni, GPizzirani, DTrincavelli, MLGoldoni, LTarozzo, GReggiani, AMartini, CPiomelli, DMelchiorre, CRosini, MCavalli, A Combining galantamine and memantine in multitargeted, new chemical entities potentially useful in Alzheimer's disease. J Med Chem 55:9708-21 (2012)  
Target
Name:
Acetylcholinesterase
Synonyms:
ACES_RAT Acetylcholinesterase and butyrylcholinesterase (AChE and BChE) Acetylcholinesterase, AChE | Ache
Type:
Enzyme
Mol. Mass.:
68193.62
Organism:
Rattus norvegicus (rat)
Description:
P37136
Residue:
614
  
Inhibitor
Name:
BDBM50398925
Synonyms:
CHEMBL2178787
Type:
Small organic molecule
Emp. Form.:
C37H56N2O3
Mol. Mass.:
576.8521
SMILES:
COc1ccc2CN(CCCCCCCCCNC34CC5CC(C)(CC(C)(C5)C3)C4)CC[C@@]34C=C[C@H](O)C[C@@H]3Oc1c24
: