Target
Thymidylate synthase
Ligand
BDBM50403881
Substrate
Meas. Tech.
ChEBML_209980
Ki
1200±n/a nM
Citation
 Bavetsias, VMarriott, JHTheti, DSMelin, JCWilson, SCJackman, AL Cyclopenta[g]quinazoline-based antifolates: the effect of the chirality at the 6-position on the inhibition of thymidylate synthase (TS). Bioorg Med Chem Lett 11:3015-7 (2001)  
Target
Name:
Thymidylate synthase
Synonyms:
TS TYSY_MOUSE | Tyms
Type:
PROTEIN
Mol. Mass.:
34957.15
Organism:
Mus musculus
Description:
ChEMBL_1340097
Residue:
307
  
Inhibitor
Name:
BDBM50403881
Synonyms:
CHEMBL102954
Type:
Small organic molecule
Emp. Form.:
C29H29N7O6S
Mol. Mass.:
603.649
SMILES:
Cc1nc2cc3CC[C@@H](N(CC#C)c4ccc(cc4)C(=O)N[C@@H](CCCS(=O)(=O)c4nnc[nH]4)C(O)=O)c3cc2c(=O)[nH]1
: