Target
Histamine H2 receptor
Ligand
BDBM50103506
Substrate
Meas. Tech.
ChEMBL_85512 (CHEMBL696493)
Ki
54±n/a nM
Citation
 Hirschfeld, JBuschauer, AElz, SSchunack, WRuat, MTraiffort, ESchwartz, JC Iodoaminopotentidine and related compounds: a new class of ligands with high affinity and selectivity for the histamine H2 receptor. J Med Chem 35:2231-8 (1992)  
Target
Name:
Histamine H2 receptor
Synonyms:
Gastric receptor I HISTAMINE H2 HRH2_CAVPO | Histamine H2-Gs alpha S
Type:
G Protein-Coupled Receptor (GPCR)
Mol. Mass.:
40567.22
Organism:
Cavia porcellus (domestic guinea pig)
Description:
For the H2 receptor-binding assays, guinea pig striatum was used.
Residue:
359
  
Inhibitor
Name:
BDBM50103506
Synonyms:
Ranitidine Zantac
Type:
Small organic molecule
Emp. Form.:
C13H22N4O3S
Mol. Mass.:
314.404
SMILES:
CNC(NCCSCc1ccc(CN(C)C)o1)=C[N+]([O-])=O
: