Target
Bcl-2-like protein 1
Ligand
BDBM21422
Substrate
Meas. Tech.
ChEMBL_687845 (CHEMBL1291409)
EC50
600±n/a nM
Citation
 Almerico, AMTutone, MLauria, A 3D-QSAR pharmacophore modeling and in silico screening of new Bcl-xl inhibitors. Eur J Med Chem 45:4774-82 (2010)  
Target
Name:
Bcl-2-like protein 1
Synonyms:
Anti-apoptotic Bcl-2 protein Apoptosis regulator Bcl-X BCL2-like 1 isoform 1 BCL2L1 Bcl-2-like protein 1 (Bcl-XL) Bcl-xL/Bcl-2-binding component 3 Bcl2-antagonist of cell death (BAD)
Type:
Mitochondrion membrane; Single-pass membrane protein
Mol. Mass.:
26039.60
Organism:
Homo sapiens (Human)
Description:
Residue:
233
  
Inhibitor
Name:
BDBM21422
Synonyms:
4-Alkyl-4-methoxypiperidine derivative, 8n | N-[(4-{[(2R)-4-(dimethylamino)-1-(phenylsulfanyl)butan-2-yl]amino}-3-nitrobenzene)sulfonyl]-4-{4-methoxy-4-[(4-phenylphenyl)methyl]piperidin-1-yl}benzamide
Type:
Small organic molecule
Emp. Form.:
C44H49N5O6S2
Mol. Mass.:
808.02
SMILES:
COC1(Cc2ccc(cc2)-c2ccccc2)CCN(CC1)c1ccc(cc1)C(=O)NS(=O)(=O)c1ccc(N[C@H](CCN(C)C)CSc2ccccc2)c(c1)[N+]([O-])=O
: