Target
Cytochrome P450 1A2
Ligand
BDBM50027793
Substrate
Meas. Tech.
ChEMBL_774163 (CHEMBL1908258)
Ki
4±n/a nM
Citation
 Fontana, EDansette, PMPoli, SM Cytochrome p450 enzymes mechanism based inhibitors: common sub-structures and reactivity. Curr Drug Metab 6:413-54 (2005)  
Target
Name:
Cytochrome P450 1A2
Synonyms:
CP1A2_RAT Cyp1a-2 Cytochrome P-448 Cytochrome P450-D
Type:
PROTEIN
Mol. Mass.:
58273.18
Organism:
Rattus norvegicus
Description:
ChEMBL_1487340
Residue:
513
  
Inhibitor
Name:
BDBM50027793
Synonyms:
CHEMBL3215311
Type:
Small organic molecule
Emp. Form.:
C19H12
Mol. Mass.:
240.2986
SMILES:
CC#Cc1ccc2ccc3cccc4ccc1c2c34
: