Target
Cytochrome P450 2B6
Ligand
BDBM50418086
Substrate
Meas. Tech.
ChEMBL_738482 (CHEMBL1743383)
Ki
2200±n/a nM
Citation
 Fontana, EDansette, PMPoli, SM Cytochrome p450 enzymes mechanism based inhibitors: common sub-structures and reactivity. Curr Drug Metab 6:413-54 (2005)  
Target
Name:
Cytochrome P450 2B6
Synonyms:
CP2B6_HUMAN Cytochrome P450 2B6 (CYP2B6)
Type:
Protein
Mol. Mass.:
56289.75
Organism:
Homo sapiens (Human)
Description:
P20813
Residue:
491
  
Inhibitor
Name:
BDBM50418086
Synonyms:
THIOTEPA | Thioplex
Type:
Small organic molecule
Emp. Form.:
C6H12N3PS
Mol. Mass.:
189.218
SMILES:
S=P(N1CC1)(N1CC1)N1CC1
: