Target
Substance-P receptor
Ligand
BDBM50419334
Substrate
Meas. Tech.
ChEMBL_775934 (CHEMBL1912677)
Ki
0.158±n/a nM
Citation
 Catalani, MPAlvaro, GBernasconi, GBettini, EBromidge, SMHeer, JTedesco, GTommasi, S Identification of novel NK1/NK3 dual antagonists for the potential treatment of schizophrenia. Bioorg Med Chem Lett 21:6899-904 (2011)  
Target
Name:
Substance-P receptor
Synonyms:
NK-1 receptor NK1 Receptor NK1R_HUMAN Neurokinin-1 (NK-1) SPR TACR1 Tachykinin receptor 1 (NK1) | tachykinin
Type:
G Protein-Coupled Receptor (GPCR)
Mol. Mass.:
46254.43
Organism:
Homo sapiens (Human)
Description:
P25103
Residue:
407
  
Inhibitor
Name:
BDBM50419334
Synonyms:
CHEMBL1911965 | CHEMBL1911967
Type:
Small organic molecule
Emp. Form.:
C30H28F7N3O3
Mol. Mass.:
611.5504
SMILES:
CN(C(=O)C(C)(C)c1cc(cc(c1)C(F)(F)F)C(F)(F)F)c1cnc(cc1-c1ccc(F)cc1C)C1CNC(=O)C1CO
: