Target
Glutamate racemase
Ligand
BDBM50421077
Substrate
Meas. Tech.
ChEMBL_842443 (CHEMBL2092116)
IC50
240±n/a nM
Citation
 Basarab, GSHill, PEyermann, CJGowravaram, MKäck, HOsimoni, E Design of inhibitors of Helicobacter pylori glutamate racemase as selective antibacterial agents: incorporation of imidazoles onto a core pyrazolopyrimidinedione scaffold to improve bioavailabilty. Bioorg Med Chem Lett 22:5600-7 (2012)  
Target
Name:
Glutamate racemase
Synonyms:
MURI_HELPJ murI
Type:
PROTEIN
Mol. Mass.:
28499.39
Organism:
Helicobacter pylori J99
Description:
ChEMBL_842443
Residue:
255
  
Inhibitor
Name:
BDBM50421077
Synonyms:
CHEMBL2087868
Type:
Small organic molecule
Emp. Form.:
C28H26ClN7O2
Mol. Mass.:
528.005
SMILES:
CC(C)n1c(=O)n(CC2CC2)c2nn(Cc3ccnc4ccc(Cl)cc34)c(-c3cc(cn3C)C#N)c2c1=O
: