Target
Glutamate racemase
Ligand
BDBM50421083
Substrate
Meas. Tech.
ChEMBL_842443 (CHEMBL2092116)
IC50
250±n/a nM
Citation
 Basarab, GSHill, PEyermann, CJGowravaram, MKäck, HOsimoni, E Design of inhibitors of Helicobacter pylori glutamate racemase as selective antibacterial agents: incorporation of imidazoles onto a core pyrazolopyrimidinedione scaffold to improve bioavailabilty. Bioorg Med Chem Lett 22:5600-7 (2012)  
Target
Name:
Glutamate racemase
Synonyms:
MURI_HELPJ murI
Type:
PROTEIN
Mol. Mass.:
28499.39
Organism:
Helicobacter pylori J99
Description:
ChEMBL_842443
Residue:
255
  
Inhibitor
Name:
BDBM50421083
Synonyms:
CHEMBL2088118
Type:
Small organic molecule
Emp. Form.:
C27H23ClN8O2
Mol. Mass.:
526.977
SMILES:
Cn1cc(nc1-c1n(Cc2ccnc3ccc(Cl)cc23)nc2n(CC3CC3)c(=O)n(CC=C)c(=O)c12)C#N
: