Target
Prostaglandin G/H synthase 2
Ligand
BDBM50424097
Substrate
Meas. Tech.
ChEMBL_937010 (CHEMBL2317149)
IC50
3900±n/a nM
Citation
 Bhardwaj, AKaur, JSharma, SKHuang, ZWuest, FKnaus, EE Hybrid fluorescent conjugates of COX-2 inhibitors: search for a COX-2 isozyme imaging cancer biomarker. Bioorg Med Chem Lett 23:163-8 (2012)  
Target
Name:
Prostaglandin G/H synthase 2
Synonyms:
COX2 Cyclooxygenase 2 (COX-2) Cyclooxygenase-2 (COX-2 AA) Cyclooxygenase-2 (COX-2) PGH2_HUMAN PHS II Prostaglandin E synthase/G/H synthase 2 Prostaglandin-endoperoxide synthase 2
Type:
Enzyme
Mol. Mass.:
69003.89
Organism:
Homo sapiens (Human)
Description:
Recombinant Cox-2 provided by Cayman (Cayman Chemical Co.,Ann Arbor, MI).
Residue:
604
  
Inhibitor
Name:
BDBM50424097
Synonyms:
CHEMBL2315327
Type:
Small organic molecule
Emp. Form.:
C47H47F3N6O4S
Mol. Mass.:
848.974
SMILES:
CCN(CC)c1ccc2c(Oc3cc(ccc3C22N(CCNS(=O)(=O)c3ccc(cc3)-n3nc(cc3-c3ccc(C)cc3)C(F)(F)F)C(=O)c3ccccc23)N(CC)CC)c1
: