Target
Focal adhesion kinase 1
Ligand
BDBM50425684
Substrate
Meas. Tech.
ChEMBL_937515 (CHEMBL2320501)
IC50
170±n/a nM
Citation
 Heinrich, TSeenisamy, JEmmanuvel, LKulkarni, SSBomke, JRohdich, FGreiner, HEsdar, CKrier, MGrädler, UMusil, D Fragment-based discovery of new highly substituted 1H-pyrrolo[2,3-b]- and 3H-imidazolo[4,5-b]-pyridines as focal adhesion kinase inhibitors. J Med Chem 56:1160-70 (2013)  
Target
Name:
Focal adhesion kinase 1
Synonyms:
FADK 1 FAK1 FLT4 Focal adhesion kinase (FAK) Focal adhesion kinase 1 (FAK) Focal adhesion kinase-related nonkinase PTK2 Protein-tyrosine kinase 2 p125FAK | pp125FAK
Type:
Tyrosine-protein kinase
Mol. Mass.:
119233.17
Organism:
Homo sapiens (Human)
Description:
Q05397
Residue:
1052
  
Inhibitor
Name:
BDBM50425684
Synonyms:
CHEMBL2315571
Type:
Small organic molecule
Emp. Form.:
C20H15BrFN5O
Mol. Mass.:
440.268
SMILES:
CNC(=O)c1ccccc1Nc1c(Br)cnc2nc([nH]c12)-c1ccc(F)cc1
: