Target
Carbonic anhydrase 12
Ligand
BDBM50426701
Substrate
Meas. Tech.
ChEMBL_939842 (CHEMBL2329435)
Ki
13±n/a nM
Citation
 Tars, KVullo, DKazaks, ALeitans, JLends, AGrandane, AZalubovskis, RScozzafava, ASupuran, CT Sulfocoumarins (1,2-benzoxathiine-2,2-dioxides): a class of potent and isoform-selective inhibitors of tumor-associated carbonic anhydrases. J Med Chem 56:293-300 (2013)  
Target
Name:
Carbonic anhydrase 12
Synonyms:
CA-XII CAH12_HUMAN Carbonic anhydrase Carbonic anhydrase XII Carbonic anhydrase XII (CAXII) | Tumor antigen HOM-RCC-3.1.3
Type:
Enzyme
Mol. Mass.:
39456.00
Organism:
Homo sapiens (Human)
Description:
Catalytic domain of human cloned isozyme was used in the assay
Residue:
354
  
Inhibitor
Name:
BDBM50426701
Synonyms:
CHEMBL2326515
Type:
Small organic molecule
Emp. Form.:
C13H11N3O5S
Mol. Mass.:
321.309
SMILES:
CCOC(=O)c1cn(nn1)-c1ccc2OS(=O)(=O)C=Cc2c1
: