Target
Activated CDC42 kinase 1
Ligand
BDBM50421257
Substrate
Meas. Tech.
ChEMBL_939163 (CHEMBL2329235)
IC50
10.0±n/a nM
Citation
 Jin, MWang, JKleinberg, AKadalbajoo, MSiu, KWCooke, ABittner, MAYao, YThelemann, AJi, QBhagwat, SMulvihill, KMRechka, JAPachter, JACrew, APEpstein, DMulvihill, MJ Discovery of potent, selective and orally bioavailable imidazo[1,5-a]pyrazine derived ACK1 inhibitors. Bioorg Med Chem Lett 23:979-84 (2013)  
Target
Name:
Activated CDC42 kinase 1
Synonyms:
ACK1 Activated CDC42 kinase 1 (ACK-1) Tyrosine kinase non-receptor protein 2
Type:
Protein
Mol. Mass.:
114577.86
Organism:
Homo sapiens (Human)
Description:
Q07912
Residue:
1038
  
Inhibitor
Name:
BDBM50421257
Synonyms:
CHEMBL2087875
Type:
Small organic molecule
Emp. Form.:
C28H31N5OS2
Mol. Mass.:
517.709
SMILES:
C(CN1CCCC1)Oc1ccc(cc1)-c1[nH]c2ncnc(NCC3SCCS3)c2c1-c1ccccc1
: