Target
Insulin-degrading enzyme
Ligand
BDBM50427697
Substrate
Meas. Tech.
ChEMBL_941899 (CHEMBL2329965)
Ki
23±n/a nM
Citation
 Abdul-Hay, SOLane, ALCaulfield, TRClaussin, CBertrand, JMasson, AChoudhry, SFauq, AHMaharvi, GMLeissring, MA Optimization of peptide hydroxamate inhibitors of insulin-degrading enzyme reveals marked substrate-selectivity. J Med Chem 56:2246-55 (2013)  
Target
Name:
Insulin-degrading enzyme
Synonyms:
Abeta-degrading protease IDE Insulin degrading enzyme (hIDE) Insulin-degrading enzyme Insulysin | insulin-degrading enzyme isoform 1 precursor
Type:
Enzyme Catalytic Domain
Mol. Mass.:
117968.59
Organism:
Homo sapiens (Human)
Description:
P14735
Residue:
1019
  
Inhibitor
Name:
BDBM50427697
Synonyms:
CHEMBL2324207
Type:
Small organic molecule
Emp. Form.:
C66H85N19O13
Mol. Mass.:
1352.5006
SMILES:
CC[C@@H](C)[C@H]1NC(=O)[C@@H](Cc2ccccc2)NC(=O)[C@@H](Cc2cnc[nH]2)NC(=O)[C@@H](CC(O)=O)NC(=O)CC[C@@H](NC(=O)[C@@H](CCCN=C(N)N)NC1=O)C(=O)N[C@H](Cc1c[nH]c2ccccc12)C(=O)N[C@H](CCCN=C(N)N)C(=O)N[C@H](Cc1ccc2ccccc2c1)C(=O)NO
: