Target
Insulin-degrading enzyme
Ligand
BDBM50427698
Substrate
Meas. Tech.
ChEMBL_941899 (CHEMBL2329965)
Ki
44±n/a nM
Citation
 Abdul-Hay, SOLane, ALCaulfield, TRClaussin, CBertrand, JMasson, AChoudhry, SFauq, AHMaharvi, GMLeissring, MA Optimization of peptide hydroxamate inhibitors of insulin-degrading enzyme reveals marked substrate-selectivity. J Med Chem 56:2246-55 (2013)  
Target
Name:
Insulin-degrading enzyme
Synonyms:
Abeta-degrading protease IDE Insulin degrading enzyme (hIDE) Insulin-degrading enzyme Insulysin | insulin-degrading enzyme isoform 1 precursor
Type:
Enzyme Catalytic Domain
Mol. Mass.:
117968.59
Organism:
Homo sapiens (Human)
Description:
P14735
Residue:
1019
  
Inhibitor
Name:
BDBM50427698
Synonyms:
CHEMBL2324206
Type:
Small organic molecule
Emp. Form.:
C57H57N7O12S
Mol. Mass.:
1064.167
SMILES:
CC(=O)N[C@@H](CCC(=O)NCCNc1cccc2c(cccc12)S(O)(=O)=O)C(=O)N[C@H](Cc1ccc(O)cc1)C(=O)N([C@H](Cc1ccccc1)C(=O)N[C@H](Cc1ccc2ccccc2c1)C(=O)NO)C(=O)c1ccccc1
: