Target
5-hydroxytryptamine receptor 2C
Ligand
BDBM50428531
Substrate
Meas. Tech.
ChEMBL_944532 (CHEMBL2339048)
EC50
2.6±n/a nM
Citation
 Fevig, JMFeng, JRossi, KAMiller, KJWu, GHung, CPUng, TMalmstrom, SEZhang, GKeim, WJCullen, MJRohrbach, KWQu, QGan, JPelleymounter, MARobl, JA Synthesis and SAR of 2,3,3a,4-tetrahydro-1H-pyrrolo[3,4-c]isoquinolin-5(9bH)-ones as 5-HT2C receptor agonists. Bioorg Med Chem Lett 23:330-5 (2012)  
Target
Name:
5-hydroxytryptamine receptor 2C
Synonyms:
5-HT-2C 5-HT2C-INI 5-HTR2C 5-hydroxytryptamine receptor 2C (5-HT-2C) 5HT-1C HTR1C Serotonin (5-HT3) receptor Serotonin Receptor 2C
Type:
G Protein-Coupled Receptor (GPCR)
Mol. Mass.:
51836.79
Organism:
Homo sapiens (Human)
Description:
P28335
Residue:
458
  
Inhibitor
Name:
BDBM50428531
Synonyms:
CHEMBL2337493
Type:
Small organic molecule
Emp. Form.:
C11H11ClN2O
Mol. Mass.:
222.671
SMILES:
Clc1cccc2[C@H]3CNC[C@@H]3NC(=O)c12
: