Target
Lysophosphatidic acid receptor 4
Ligand
BDBM50430006
Substrate
Meas. Tech.
ChEMBL_946257 (CHEMBL2344995)
EC50
4.9±n/a nM
Citation
 Jiang, GInoue, AAoki, JPrestwich, GD Phosphorothioate analogs of sn-2 radyl lysophosphatidic acid (LPA): metabolically stabilized LPA receptor agonists. Bioorg Med Chem Lett 23:1865-9 (2013)  
Target
Name:
Lysophosphatidic acid receptor 4
Synonyms:
GPR23 LPAR4 P2RY9
Type:
PROTEIN
Mol. Mass.:
41910.31
Organism:
Homo sapiens (Human)
Description:
ChEMBL_946257
Residue:
370
  
Inhibitor
Name:
BDBM50430006
Synonyms:
CHEMBL2335048
Type:
Small organic molecule
Emp. Form.:
C22H47O5PS
Mol. Mass.:
454.644
SMILES:
[C@H](COP(O)(O)=S)OC
: