Target
Carbonic anhydrase 2
Ligand
BDBM26988
Substrate
Meas. Tech.
ChEMBL_942941 (CHEMBL2343319)
Ki
35000000±n/a nM
Citation
 Monti, SMDe Simone, GDathan, NALudwig, MVullo, DScozzafava, ACapasso, CSupuran, CT Kinetic and anion inhibition studies of aß-carbonic anhydrase (FbiCA 1) from the C4 plant Flaveria bidentis. Bioorg Med Chem Lett 23:1626-30 (2013)  
Target
Name:
Carbonic anhydrase 2
Synonyms:
CA-II CAC Carbonate dehydratase II Carbonic anhydrase 2 (CA-II) Carbonic anhydrase C Carbonic anhydrase II (CA-II) Carbonic anhydrase II (hCA II) | Carbonic anhydrase isoenzyme II (hCA II)
Type:
Enzyme
Mol. Mass.:
29250.71
Organism:
Homo sapiens (Human)
Description:
P00918
Residue:
260
  
Inhibitor
Name:
BDBM26988
Synonyms:
CHEMBL1644029 CHEMBL186200 nitrate ion | nitrooxidane
Type:
Ion
Emp. Form.:
NO3
Mol. Mass.:
62.0054
SMILES:
[O-][N+]([O-])=O
: