Target
Virulence factor transcriptional regulator MvfR
Ligand
BDBM50440124
Substrate
Meas. Tech.
ChEMBL_980938 (CHEMBL2427491)
EC50
7500±n/a nM
Citation
 Zender, MKlein, THenn, CKirsch, BMaurer, CKKail, DRitter, CDolezal, OSteinbach, AHartmann, RW Discovery and biophysical characterization of 2-amino-oxadiazoles as novel antagonists of PqsR, an important regulator of Pseudomonas aeruginosa virulence. J Med Chem 56:6761-74 (2013)  
Target
Name:
Virulence factor transcriptional regulator MvfR
Synonyms:
Transcriptional regulator MvfR
Type:
PROTEIN
Mol. Mass.:
37217.11
Organism:
Pseudomonas aeruginosa PA14
Description:
ChEMBL_107649
Residue:
332
  
Inhibitor
Name:
BDBM50440124
Synonyms:
CHEMBL2426232
Type:
Small organic molecule
Emp. Form.:
C9H6F3N3O
Mol. Mass.:
229.1586
SMILES:
Nc1nnc(o1)-c1cccc(c1)C(F)(F)F
: